make: *** [smtpd_sasl_glue.o] Error 1

Mehrgan Khakbiz khakbiz at
Tue Dec 2 06:23:51 EST 2003

does any one know why i get this error when compiling postfix-1.1.13 with cyrus-sasl-2.1.15.

smtpd_sasl_glue.c:352: warning: passing arg 4 of `sasl_server_step' from incompatible pointer type
smtpd_sasl_glue.c:352: too many arguments to function `sasl_server_step'
smtpd_sasl_glue.c:373: warning: passing arg 3 of `sasl_getprop' from incompatible pointer type
make: *** [smtpd_sasl_glue.o] Error 1
make: *** [update] Error 1
-------------- next part --------------
An HTML attachment was scrubbed...

More information about the Info-cyrus mailing list